Target
Beta-2 adrenergic receptor
Ligand
BDBM50098668
Substrate
Meas. Tech.
ChEMBL_218120 (CHEMBL822409)
Ki
0.100000±n/a nM
Citation
 Hu, BEllingboe, JHan, SLargis, EMulvey, ROliphant, ASum, FWTillett, J (4-Piperidin-1-yl)phenyl amides: potent and selective human beta(3) agonists. J Med Chem 44:1456-66 (2001)  
Target
Name:
Beta-2 adrenergic receptor
Synonyms:
ADRB2 ADRB2_HUMAN Beta-2 adrenoceptor | Beta-2 adrenoreceptor
Type:
Mol. Mass.:
46461.69
Organism:
Homo sapiens (Human)
Description:
P07550
Residue:
413
  
Inhibitor
Name:
BDBM50098668
Synonyms:
4-(3-tert-Butylamino-2-hydroxy-propoxy)-1,3-dihydro-benzoimidazol-2-one CHEMBL36060
Type:
Small organic molecule
Emp. Form.:
C14H21N3O3
Mol. Mass.:
279.3348
SMILES:
CC(C)(C)NC[C@H](O)COc1cccc2[nH]c(=O)[nH]c12
: