Target
Delta-type opioid receptor
Ligand
BDBM50098673
Substrate
Meas. Tech.
ChEMBL_146322 (CHEMBL757531)
Ki
4.7±n/a nM
Citation
 McLamore, SUllrich, TRothman, RBXu, HDersch, CCoop, ADavis, PPorreca, FJacobson, AERice, KC Effect of N-alkyl and N-alkenyl substituents in noroxymorphindole, 17-substituted-6,7-dehydro-4,5alpha-epoxy-3,14-dihydroxy-6,7:2',3'-indolomorphinans, on opioid receptor affinity, selectivity, and efficacy. J Med Chem 44:1471-4 (2001)  
Target
Name:
Delta-type opioid receptor
Synonyms:
DOR-1 MSL-2 OPRD_MOUSE Oprd1
Type:
Enzyme Catalytic Domain
Mol. Mass.:
40577.25
Organism:
MOUSE
Description:
P32300
Residue:
372
  
Inhibitor
Name:
BDBM50098673
Synonyms:
17-(2-methyl-2-propenyl)-6,7-dehydro-4,5alpha-epoxy-3,14-dihydroxy-6,7:2',3'-indolomorphinan
Type:
Small organic molecule
Emp. Form.:
C25H24N2O3
Mol. Mass.:
400.4697
SMILES:
CC(=C)N1CC[C@@]23[C@H]4Oc5c2c(CC1[C@]3(O)Cc1c4[nH]c2ccccc12)ccc5O
: