Target
Vesicular glutamate transporter 3
Ligand
BDBM50113314
Substrate
Meas. Tech.
ChEMBL_213568 (CHEMBL816125)
Ki
41000±n/a nM
Citation
 Carrigan, CNBartlett, RDEsslinger, CSCybulski, KATongcharoensirikul, PBridges, RJThompson, CM Synthesis and in vitro pharmacology of substituted quinoline-2,4-dicarboxylic acids as inhibitors of vesicular glutamate transport. J Med Chem 45:2260-76 (2002)  
Target
Name:
Vesicular glutamate transporter 3
Synonyms:
Slc17a8 Vglut3
Type:
PROTEIN
Mol. Mass.:
64750.88
Organism:
Rattus norvegicus
Description:
ChEMBL_213568
Residue:
588
  
Inhibitor
Name:
BDBM50113314
Synonyms:
6-Biphenyl-4-yl-quinoline-2,4-dicarboxylic acid | CHEMBL312117
Type:
Small organic molecule
Emp. Form.:
C23H15NO4
Mol. Mass.:
369.3695
SMILES:
OC(=O)c1cc(C(O)=O)c2cc(ccc2n1)-c1ccc(cc1)-c1ccccc1
: