Target
Prothrombin
Ligand
BDBM50066620
Substrate
Meas. Tech.
ChEMBL_48316 (CHEMBL658079)
Ki
27000±n/a nM
Citation
 Phillips, GGuilford, WJBuckman, BODavey, DDEagen, KAKoovakkat, SLiang, AMcCarrick, MMohan, RNg, HPPinkerton, MSubramanyam, BHo, ETrinh, LWhitlow, MWu, SXu, WMorrissey, MM Design, synthesis, and activity of a novel series of factor Xa inhibitors: optimization of arylamidine groups. J Med Chem 45:2484-93 (2002)  
Target
Name:
Prothrombin
Synonyms:
Activation peptide fragment 1 Coagulation factor II Prothrombin precursor Thrombin heavy chain | Thrombin light chain
Type:
Protein
Mol. Mass.:
70029.57
Organism:
Homo sapiens (Human)
Description:
P00734
Residue:
622
  
Inhibitor
Name:
BDBM50066620
Synonyms:
2,6-Bis-(3-carbamimidoyl-phenoxy)-isonicotinic acid | CHEMBL48604
Type:
Small organic molecule
Emp. Form.:
C20H17N5O4
Mol. Mass.:
391.3801
SMILES:
NC(=N)c1cccc(Oc2cc(cc(Oc3cccc(c3)C(N)=N)n2)C(O)=O)c1
: