Target
Coagulation factor X
Ligand
BDBM50066622
Substrate
Meas. Tech.
ChEMBL_49312 (CHEMBL663411)
Ki
3.1±n/a nM
Citation
 Phillips, GGuilford, WJBuckman, BODavey, DDEagen, KAKoovakkat, SLiang, AMcCarrick, MMohan, RNg, HPPinkerton, MSubramanyam, BHo, ETrinh, LWhitlow, MWu, SXu, WMorrissey, MM Design, synthesis, and activity of a novel series of factor Xa inhibitors: optimization of arylamidine groups. J Med Chem 45:2484-93 (2002)  
Target
Name:
Coagulation factor X
Synonyms:
Activated coagulation factor X (FXa) Coagulation factor X precursor F10 Factor X heavy chain Factor Xa Stuart-Prower factor
Type:
Enzyme
Mol. Mass.:
54726.60
Organism:
Homo sapiens (Human)
Description:
Residue:
488
  
Inhibitor
Name:
BDBM50066622
Synonyms:
2-(5-Carbamimidoyl-2-hydroxy-phenoxy)-6-(3-dimethylcarbamoyl-phenoxy)-isonicotinic acid | CHEMBL79303
Type:
Small organic molecule
Emp. Form.:
C22H20N4O6
Mol. Mass.:
436.4174
SMILES:
CN(C)C(=O)c1cccc(Oc2cc(cc(Oc3cc(ccc3O)C(N)=N)n2)C(O)=O)c1
: