Target
Melanocortin receptor 3
Ligand
BDBM50114088
Substrate
Meas. Tech.
ChEMBL_106829 (CHEMBL717670)
EC50
42000±n/a nM
Citation
 Kavarana, MJTrivedi, DCai, MYing, JHammer, MCabello, CGrieco, PHan, GHruby, VJ Novel cyclic templates of alpha-MSH give highly selective and potent antagonists/agonists for human melanocortin-3/4 receptors. J Med Chem 45:2644-50 (2002)  
Target
Name:
Melanocortin receptor 3
Synonyms:
MC3-R MC3R_HUMAN Melanocortin receptor (M3 and M4)
Type:
Enzyme
Mol. Mass.:
36044.86
Organism:
Homo sapiens (Human)
Description:
P41968
Residue:
323
  
Inhibitor
Name:
BDBM50114088
Synonyms:
9-Benzyl-6-(3-guanidino-propyl)-3-(1H-indol-3-ylmethyl)-12-methyl-2,5,8,11,14,17-hexaoxo-1,4,7,10,13,18hexaaza-cyclotricosane-23-carboxylic acid amide | CHEMBL436903
Type:
Small organic molecule
Emp. Form.:
C39H53N11O7
Mol. Mass.:
787.9076
SMILES:
C[C@@H]1NC(=O)CCC(=O)NCCCC[C@@H](NC(=O)[C@@H](Cc2c[nH]c3ccccc23)NC(=O)[C@H](CCCNC(N)=N)NC(=O)[C@@H](Cc2ccccc2)NC1=O)C(N)=O
: