Target
Melanocortin receptor 5
Ligand
BDBM50114077
Substrate
Meas. Tech.
ChEMBL_106653 (CHEMBL712998)
Ki
<1±n/a nM
Comments
Zero 01/04/2022
Citation
 Kavarana, MJTrivedi, DCai, MYing, JHammer, MCabello, CGrieco, PHan, GHruby, VJ Novel cyclic templates of alpha-MSH give highly selective and potent antagonists/agonists for human melanocortin-3/4 receptors. J Med Chem 45:2644-50 (2002)  
Target
Name:
Melanocortin receptor 5
Synonyms:
MC-2 MC5R Melanocortin MC5 Melanocortin receptor 5 | Melanocortin receptor 5 (MC5R)
Type:
Enzyme
Mol. Mass.:
36612.92
Organism:
Homo sapiens (Human)
Description:
P33032
Residue:
325
  
Inhibitor
Name:
BDBM50114077
Synonyms:
6-(3-Guanidino-propyl)-12-(3H-imidazol-4-ylmethyl)-3-(1H-indol-3-ylmethyl)-9-methyl-2,5,8,11,14,17-hexaoxo-1,4,7,10,13,18hexaaza-cyclotricosane-23-carboxylic acid amide | CHEMBL69175
Type:
Small organic molecule
Emp. Form.:
C36H51N13O7
Mol. Mass.:
777.873
SMILES:
C[C@H]1NC(=O)[C@H](Cc2cnc[nH]2)NC(=O)CCC(=O)NCCCC[C@@H](NC(=O)[C@@H](Cc2c[nH]c3ccccc23)NC(=O)[C@H](CCCNC(N)=N)NC1=O)C(N)=O
: