Target
Adenosine receptor A2a
Ligand
BDBM50116458
Substrate
Meas. Tech.
ChEMBL_32152 (CHEMBL646279)
Ki
11900±n/a nM
Citation
 Müller, CEThorand, MQurishi, RDiekmann, MJacobson, KAPadgett, WLDaly, JW Imidazo[2,1-i]purin-5-ones and related tricyclic water-soluble purine derivatives: potent A(2A)- and A(3)-adenosine receptor antagonists. J Med Chem 45:3440-50 (2002)  
Target
Name:
Adenosine receptor A2a
Synonyms:
AA2AR_RAT Adenosine A2 receptor Adenosine Receptors A2a (A2a) Adenosine receptors A2a Rat striatal adenosine A2a receptor
Type:
G Protein-Coupled Receptor (GPCR)
Mol. Mass.:
45015.65
Organism:
Rattus norvegicus (rat)
Description:
Rat A2A receptors expressed in CHO cells.
Residue:
410
  
Inhibitor
Name:
BDBM50116458
Synonyms:
1-Methyl-2-phenyl-1,4,6,7-tetrahydro-1,3,4,5a,8-pentaaza-as-indacen-5-one | CHEMBL117962
Type:
Small organic molecule
Emp. Form.:
C14H13N5O
Mol. Mass.:
267.2859
SMILES:
Cn1c(nc2NC(=O)N3CCN=C3c12)-c1ccccc1
: