Target
Adenosine receptor A2b
Ligand
BDBM50116458
Substrate
Meas. Tech.
ChEMBL_4798 (CHEMBL618343)
Ki
7000±n/a nM
Citation
 Müller, CEThorand, MQurishi, RDiekmann, MJacobson, KAPadgett, WLDaly, JW Imidazo[2,1-i]purin-5-ones and related tricyclic water-soluble purine derivatives: potent A(2A)- and A(3)-adenosine receptor antagonists. J Med Chem 45:3440-50 (2002)  
Target
Name:
Adenosine receptor A2b
Synonyms:
AA2BR_MOUSE Adora2b
Type:
PROTEIN
Mol. Mass.:
36130.09
Organism:
Mus musculus
Description:
ChEMBL_11831
Residue:
332
  
Inhibitor
Name:
BDBM50116458
Synonyms:
1-Methyl-2-phenyl-1,4,6,7-tetrahydro-1,3,4,5a,8-pentaaza-as-indacen-5-one | CHEMBL117962
Type:
Small organic molecule
Emp. Form.:
C14H13N5O
Mol. Mass.:
267.2859
SMILES:
Cn1c(nc2NC(=O)N3CCN=C3c12)-c1ccccc1
: