Target
Adenosine receptor A1
Ligand
BDBM50041576
Substrate
Meas. Tech.
ChEMBL_28987 (CHEMBL636765)
Ki
3900±n/a nM
Citation
 Müller, CEThorand, MQurishi, RDiekmann, MJacobson, KAPadgett, WLDaly, JW Imidazo[2,1-i]purin-5-ones and related tricyclic water-soluble purine derivatives: potent A(2A)- and A(3)-adenosine receptor antagonists. J Med Chem 45:3440-50 (2002)  
Target
Name:
Adenosine receptor A1
Synonyms:
AA1R_RAT ADENOSINE A1 high Adenosine A1 receptor (A1) Adenosine receptors A1 | Adora1
Type:
Protein
Mol. Mass.:
36704.13
Organism:
Rattus norvegicus (rat)
Description:
Residue:
326
  
Inhibitor
Name:
BDBM50041576
Synonyms:
1,3,7-Trimethyl-8-((E)-styryl)-3,7-dihydro-purine-2,6-dione CHEMBL26897
Type:
Small organic molecule
Emp. Form.:
C16H16N4O2
Mol. Mass.:
296.3238
SMILES:
Cn1c(\C=C\c2ccccc2)nc2n(C)c(=O)n(C)c(=O)c12
: