Target
Carbonic anhydrase 1
Ligand
BDBM50117111
Substrate
Meas. Tech.
ChEMBL_47512 (CHEMBL657822)
Ki
3±n/a nM
Citation
 Abbate, FSupuran, CTScozzafava, AOrioli, PStubbs, MTKlebe, G Nonaromatic sulfonamide group as an ideal anchor for potent human carbonic anhydrase inhibitors: role of hydrogen-bonding networks in ligand binding and drug design. J Med Chem 45:3583-7 (2002)  
Target
Name:
Carbonic anhydrase 1
Synonyms:
CA-I CAB Carbonate dehydratase I Carbonic anhydrase 1 (CA I) Carbonic anhydrase 1 (Recombinant CA I) Carbonic anhydrase B Carbonic anhydrase I (CA I) Carbonic anhydrase I (CAI) Carbonic anhydrase isoenzyme I (hCA I) | hCA
Type:
Enzyme
Mol. Mass.:
28873.37
Organism:
Homo sapiens (Human)
Description:
P00915
Residue:
261
  
Inhibitor
Name:
BDBM50117111
Synonyms:
CHEMBL334013 | N-(aminosulfonyl)-2,3,4,5,6-pentafluorobenzenesulfonamide
Type:
Small organic molecule
Emp. Form.:
C6H3F5N2O4S2
Mol. Mass.:
326.221
SMILES:
NS(=O)(=O)NS(=O)(=O)c1c(F)c(F)c(F)c(F)c1F
: