Target
P2Y purinoceptor 1
Ligand
BDBM50118233
Substrate
Meas. Tech.
ChEMBL_147717 (CHEMBL759187)
EC50
19000±n/a nM
Citation
 Jacobson, KAJarvis, MFWilliams, M Purine and pyrimidine (P2) receptors as drug targets. J Med Chem 45:4057-93 (2002)  
Target
Name:
P2Y purinoceptor 1
Synonyms:
P2RY1 | P2RY1_MELGA
Type:
Mol. Mass.:
41199.64
Organism:
Meleagris gallopavo
Description:
Residue:
362
  
Inhibitor
Name:
BDBM50118233
Synonyms:
2'-deoxyadenosine 5'-(tetrahydrogen triphosphate) CHEMBL335538 | dATP
Type:
Small organic molecule
Emp. Form.:
C10H16N5O12P3
Mol. Mass.:
491.1816
SMILES:
Nc1ncnc2n(cnc12)[C@H]1C[C@H](O)[C@@H](COP(O)(=O)OP(O)(=O)OP(O)(O)=O)O1
: