Target
P2Y purinoceptor 1
Ligand
BDBM50118231
Substrate
Meas. Tech.
ChEMBL_147575 (CHEMBL751772)
Kd
2900±n/a nM
Citation
 Jacobson, KAJarvis, MFWilliams, M Purine and pyrimidine (P2) receptors as drug targets. J Med Chem 45:4057-93 (2002)  
Target
Name:
P2Y purinoceptor 1
Synonyms:
ATP receptor P2RY1_HUMAN P2Y1 Purinergic receptor P2Y1
Type:
Enzyme
Mol. Mass.:
42090.25
Organism:
Homo sapiens (Human)
Description:
P47900
Residue:
373
  
Inhibitor
Name:
BDBM50118231
Synonyms:
CHEMBL134193 | Cibachron Blue 3GA
Type:
Small organic molecule
Emp. Form.:
C29H17ClN7O11S3
Mol. Mass.:
771.135
SMILES:
Nc1c(cc(Nc2ccc(Nc3nc(Cl)nc(Nc4ccccc4S([O-])(=O)=O)n3)c(c2)S([O-])(=O)=O)c2C(=O)c3ccccc3C(=O)c12)S([O-])(=O)=O
: