Target
P2X purinoceptor 1
Ligand
BDBM50118237
Substrate
Meas. Tech.
ChEMBL_149734 (CHEMBL759517)
Kd
800±n/a nM
Citation
 Jacobson, KAJarvis, MFWilliams, M Purine and pyrimidine (P2) receptors as drug targets. J Med Chem 45:4057-93 (2002)  
Target
Name:
P2X purinoceptor 1
Synonyms:
ATP receptor P2X1 Purinergic receptor RP-2 protein
Type:
Enzyme Catalytic Domain
Mol. Mass.:
44969.95
Organism:
RAT
Description:
Purinergic, P2X1 0 RAT::P47824
Residue:
399
  
Inhibitor
Name:
BDBM50118237
Synonyms:
CHEMBL130059 | Uniblue A
Type:
Small organic molecule
Emp. Form.:
C22H15N2O7S2
Mol. Mass.:
483.494
SMILES:
Nc1c2C(=O)c3ccccc3C(=O)c2c(Nc2cccc(c2)S(=O)(=O)C=C)cc1S([O-])(=O)=O
: