Target
P2X purinoceptor 2
Ligand
BDBM50118216
Substrate
Meas. Tech.
ChEMBL_149739 (CHEMBL759522)
EC50
39500±n/a nM
Citation
 Jacobson, KAJarvis, MFWilliams, M Purine and pyrimidine (P2) receptors as drug targets. J Med Chem 45:4057-93 (2002)  
Target
Name:
P2X purinoceptor 2
Synonyms:
ATP receptor P2RX2_HUMAN Purinergic receptor | PurinergicP2X2/3
Type:
Enzyme Catalytic Domain
Mol. Mass.:
51765.18
Organism:
Homo sapiens (Human)
Description:
PurinergicP2X2/3 0 HUMAN::Q9UBL9
Residue:
471
  
Inhibitor
Name:
BDBM50118216
Synonyms:
(4-formyl-5-hydroxy-6-methylpyridin-3-yl)methyl dihydrogen phosphate pyridoxal 5'-(dihydrogen phosphate) | pyridoxal 5'-phosphate
Type:
Small organic molecule
Emp. Form.:
C8H10NO6P
Mol. Mass.:
247.1419
SMILES:
Cc1ncc(COP(O)(O)=O)c(C=O)c1O
: