Target
Carbonic anhydrase 4
Ligand
BDBM16668
Substrate
Meas. Tech.
ChEMBL_45269 (CHEMBL658221)
Ki
46±n/a nM
Citation
 Masereel, BRolin, SAbbate, FScozzafava, ASupuran, CT Carbonic anhydrase inhibitors: anticonvulsant sulfonamides incorporating valproyl and other lipophilic moieties. J Med Chem 45:312-20 (2002)  
Target
Name:
Carbonic anhydrase 4
Synonyms:
CA-IV CAH4_BOVIN Carbonic Anhydrase IV Carbonic anhydrase 4
Type:
Enzyme
Mol. Mass.:
35152.74
Organism:
Bos taurus (bovine)
Description:
Bovine isozyme, isolated from lung microsomes
Residue:
312
  
Inhibitor
Name:
BDBM16668
Synonyms:
2,2-dimethyl-N-(5-sulfamoyl-1,3,4-thiadiazol-2-yl)propanamide heterocyclic sulfonamide compound 33
Type:
Small organic molecule
Emp. Form.:
C7H12N4O3S2
Mol. Mass.:
264.325
SMILES:
CC(C)(C)C(=O)Nc1nnc(s1)S(N)(=O)=O
: