Target
Carbonic anhydrase 2
Ligand
BDBM50108575
Substrate
Meas. Tech.
ChEMBL_45048 (CHEMBL658046)
Ki
1.2±n/a nM
Citation
 Masereel, BRolin, SAbbate, FScozzafava, ASupuran, CT Carbonic anhydrase inhibitors: anticonvulsant sulfonamides incorporating valproyl and other lipophilic moieties. J Med Chem 45:312-20 (2002)  
Target
Name:
Carbonic anhydrase 2
Synonyms:
CA-II CAC Carbonate dehydratase II Carbonic anhydrase 2 (CA-II) Carbonic anhydrase C Carbonic anhydrase II (CA-II) Carbonic anhydrase II (hCA II) | Carbonic anhydrase isoenzyme II (hCA II)
Type:
Enzyme
Mol. Mass.:
29250.71
Organism:
Homo sapiens (Human)
Description:
P00918
Residue:
260
  
Inhibitor
Name:
BDBM50108575
Synonyms:
3-(4-Iodo-benzenesulfonylamino)-N-(5-sulfamoyl-[1,3,4]thiadiazol-2-yl)-propionamide | CHEMBL108502
Type:
Small organic molecule
Emp. Form.:
C11H12IN5O5S3
Mol. Mass.:
517.343
SMILES:
NS(=O)(=O)c1nnc(NC(=O)CCNS(=O)(=O)c2ccc(I)cc2)s1
: