Target
Carbonic anhydrase 1
Ligand
BDBM50108585
Substrate
Meas. Tech.
ChEMBL_47501 (CHEMBL662728)
Ki
5.5±n/a nM
Citation
 Masereel, BRolin, SAbbate, FScozzafava, ASupuran, CT Carbonic anhydrase inhibitors: anticonvulsant sulfonamides incorporating valproyl and other lipophilic moieties. J Med Chem 45:312-20 (2002)  
Target
Name:
Carbonic anhydrase 1
Synonyms:
CA-I CAB Carbonate dehydratase I Carbonic anhydrase 1 (CA I) Carbonic anhydrase 1 (Recombinant CA I) Carbonic anhydrase B Carbonic anhydrase I (CA I) Carbonic anhydrase I (CAI) Carbonic anhydrase isoenzyme I (hCA I) | hCA
Type:
Enzyme
Mol. Mass.:
28873.37
Organism:
Homo sapiens (Human)
Description:
P00915
Residue:
261
  
Inhibitor
Name:
BDBM50108585
Synonyms:
3-[4-(5-Sulfamoyl-[1,3,4]thiadiazol-2-ylsulfamoyl)-phenylcarbamoyl]-bicyclo[2.2.1]hept-5-ene-2-carboxylic acid | CHEMBL111216
Type:
Small organic molecule
Emp. Form.:
C17H17N5O7S3
Mol. Mass.:
499.541
SMILES:
NS(=O)(=O)c1nnc(NS(=O)(=O)c2ccc(NC(=O)[C@@H]3C4CC(C=C4)C3C(O)=O)cc2)s1
: