Target
Carbonic anhydrase 4
Ligand
BDBM50108571
Substrate
Meas. Tech.
ChEMBL_45269 (CHEMBL658221)
Ki
13±n/a nM
Citation
 Masereel, BRolin, SAbbate, FScozzafava, ASupuran, CT Carbonic anhydrase inhibitors: anticonvulsant sulfonamides incorporating valproyl and other lipophilic moieties. J Med Chem 45:312-20 (2002)  
Target
Name:
Carbonic anhydrase 4
Synonyms:
CA-IV CAH4_BOVIN Carbonic Anhydrase IV Carbonic anhydrase 4
Type:
Enzyme
Mol. Mass.:
35152.74
Organism:
Bos taurus (bovine)
Description:
Bovine isozyme, isolated from lung microsomes
Residue:
312
  
Inhibitor
Name:
BDBM50108571
Synonyms:
2-Propyl-pentanoic acid 2-(2-sulfamoyl-benzothiazol-6-yloxy)-ethyl ester | CHEMBL108381
Type:
Small organic molecule
Emp. Form.:
C17H24N2O5S2
Mol. Mass.:
400.513
SMILES:
CCCC(CCC)C(=O)OCCOc1ccc2nc(sc2c1)S(N)(=O)=O
: