Target
Carbonic anhydrase 2
Ligand
BDBM50108572
Substrate
Meas. Tech.
ChEMBL_45048 (CHEMBL658046)
Ki
9±n/a nM
Citation
 Masereel, BRolin, SAbbate, FScozzafava, ASupuran, CT Carbonic anhydrase inhibitors: anticonvulsant sulfonamides incorporating valproyl and other lipophilic moieties. J Med Chem 45:312-20 (2002)  
Target
Name:
Carbonic anhydrase 2
Synonyms:
CA-II CAC Carbonate dehydratase II Carbonic anhydrase 2 (CA-II) Carbonic anhydrase C Carbonic anhydrase II (CA-II) Carbonic anhydrase II (hCA II) | Carbonic anhydrase isoenzyme II (hCA II)
Type:
Enzyme
Mol. Mass.:
29250.71
Organism:
Homo sapiens (Human)
Description:
P00918
Residue:
260
  
Inhibitor
Name:
BDBM50108572
Synonyms:
(5-Sulfamoyl-[1,3,4]thiadiazol-2-yl)-carbamic acid tert-butyl ester | CHEMBL322589
Type:
Small organic molecule
Emp. Form.:
C7H12N4O4S2
Mol. Mass.:
280.325
SMILES:
CC(C)(C)OC(=O)Nc1nnc(s1)S(N)(=O)=O
: