Target
Carbonic anhydrase 2
Ligand
BDBM50108589
Substrate
Meas. Tech.
ChEMBL_45048 (CHEMBL658046)
Ki
10±n/a nM
Citation
 Masereel, BRolin, SAbbate, FScozzafava, ASupuran, CT Carbonic anhydrase inhibitors: anticonvulsant sulfonamides incorporating valproyl and other lipophilic moieties. J Med Chem 45:312-20 (2002)  
Target
Name:
Carbonic anhydrase 2
Synonyms:
CA-II CAC Carbonate dehydratase II Carbonic anhydrase 2 (CA-II) Carbonic anhydrase C Carbonic anhydrase II (CA-II) Carbonic anhydrase II (hCA II) | Carbonic anhydrase isoenzyme II (hCA II)
Type:
Enzyme
Mol. Mass.:
29250.71
Organism:
Homo sapiens (Human)
Description:
P00918
Residue:
260
  
Inhibitor
Name:
BDBM50108589
Synonyms:
3,4,5-Trimethoxy-N-(5-sulfamoyl-[1,3,4]thiadiazol-2-yl)-benzamide | CHEMBL111336
Type:
Small organic molecule
Emp. Form.:
C12H14N4O6S2
Mol. Mass.:
374.393
SMILES:
COc1cc(cc(OC)c1OC)C(=O)Nc1nnc(s1)S(N)(=O)=O
: