Target
5-hydroxytryptamine receptor 2A
Ligand
BDBM50099273
Substrate
Meas. Tech.
ChEMBL_2290 (CHEMBL617075)
Ki
0.06±n/a nM
Citation
 Fletcher, SRBurkamp, FBlurton, PCheng, SKClarkson, RO'Connor, DSpinks, DTudge, Mvan Niel, MBPatel, SChapman, KMarwood, RShepheard, SBentley, GCook, GPBristow, LJCastro, JLHutson, PHMacLeod, AM 4-(Phenylsulfonyl)piperidines: novel, selective, and bioavailable 5-HT(2A) receptor antagonists. J Med Chem 45:492-503 (2002)  
Target
Name:
5-hydroxytryptamine receptor 2A
Synonyms:
5-HT-2 5-HT2A 5-hydroxytryptamine receptor 2A (5HT-2A) 5HT2A_HUMAN HTR2A | Serotonin receptor 2A
Type:
undefined
Mol. Mass.:
52607.65
Organism:
Homo sapiens (Human)
Description:
P28223
Residue:
471
  
Inhibitor
Name:
BDBM50099273
Synonyms:
6-Fluoro-3-(4-fluoro-piperidin-3-yl)-2-phenyl-1H-indole | CHEMBL288856
Type:
Small organic molecule
Emp. Form.:
C19H18F2N2
Mol. Mass.:
312.3564
SMILES:
F[C@@H]1CCNCC1c1c([nH]c2cc(F)ccc12)-c1ccccc1
: