Target
Prothrombin
Ligand
BDBM50118721
Substrate
Meas. Tech.
ChEMBL_208329 (CHEMBL813561)
Ki
3.5±n/a nM
Citation
 Adang, AEde Man, APVogel, GMGrootenhuis, PDSmit, MJPeters, CAVisser, ARewinkel, JBvan Dinther, TLucas, HKelder, Jvan Aelst, SMeuleman, DGvan Boeckel, CA Unique overlap in the prerequisites for thrombin inhibition and oral bioavailability resulting in potent oral antithrombotics. J Med Chem 45:4419-32 (2002)  
Target
Name:
Prothrombin
Synonyms:
Activation peptide fragment 1 Coagulation factor II Prothrombin precursor Thrombin heavy chain | Thrombin light chain
Type:
Protein
Mol. Mass.:
70029.57
Organism:
Homo sapiens (Human)
Description:
P00734
Residue:
622
  
Inhibitor
Name:
BDBM50118721
Synonyms:
(S)-N-((S)-6-amino-1-oxo-1-(thiazol-2-yl)hexan-2-yl)-1-((R)-2-amino-3-cyclohexylpropanoyl)pyrrolidine-2-carboxamide CHEMBL336048
Type:
Small organic molecule
Emp. Form.:
C23H37N5O3S
Mol. Mass.:
463.637
SMILES:
NCCCC[C@H](NC(=O)[C@@H]1CCCN1C(=O)[C@H](N)CC1CCCCC1)C(=O)c1nccs1
: