Target
Adenosine receptor A3
Ligand
BDBM50118804
Substrate
Meas. Tech.
ChEMBL_30636 (CHEMBL875922)
Ki
3.9±n/a nM
Citation
 Gao, ZGKim, SKBiadatti, TChen, WLee, KBarak, DKim, SGJohnson, CRJacobson, KA Structural determinants of A(3) adenosine receptor activation: nucleoside ligands at the agonist/antagonist boundary. J Med Chem 45:4471-84 (2002)  
Target
Name:
Adenosine receptor A3
Synonyms:
A3 adenosine receptor (hA3) ADORA3 | Adenosine A3 receptor (A3AR)
Type:
G Protein-Coupled Receptor (GPCR)
Mol. Mass.:
36197.32
Organism:
Homo sapiens (Human)
Description:
P0DMS8
Residue:
318
  
Inhibitor
Name:
BDBM50118804
Synonyms:
1-Hydroxymethyl-4-[6-(3-iodo-benzylamino)-purin-9-yl]-bicyclo[3.1.0]hexane-2,3-diol | CHEMBL138781
Type:
Small organic molecule
Emp. Form.:
C19H20IN5O3
Mol. Mass.:
493.2983
SMILES:
OCC12CC1C(C(O)C2O)n1cnc2c(NCc3cccc(I)c3)ncnc12
: