Target
Gag-Pol polyprotein [489-587]
Ligand
BDBM50121502
Substrate
Meas. Tech.
ChEMBL_158026 (CHEMBL768619)
Ki
0.6±n/a nM
Kd
14±n/a nM
KON
6390000 M-1s-1
Citation
 Markgren, POSchaal, WHämäläinen, MKarlén, AHallberg, ASamuelsson, BDanielson, UH Relationships between structure and interaction kinetics for HIV-1 protease inhibitors. J Med Chem 45:5430-9 (2002)  
Target
Name:
Gag-Pol polyprotein [489-587]
Synonyms:
Human immunodeficiency virus type 1 protease Pol polyprotein | gag-pol
Type:
Enzyme Subunit
Mol. Mass.:
10781.16
Organism:
Human immunodeficiency virus type 1
Description:
P04585[489-587]
Residue:
99
  
Inhibitor
Name:
BDBM50121502
Synonyms:
2,5-Bis-benzyloxy-3,4-dihydroxy-hexanedioic acid bis-[(2-hydroxy-indan-1-yl)-amide] | CHEMBL264040
Type:
Small organic molecule
Emp. Form.:
C38H40N2O8
Mol. Mass.:
652.7328
SMILES:
O[C@H]([C@@H](O)[C@@H](OCc1ccccc1)C(=O)NC1[C@H](O)Cc2ccccc12)[C@@H](OCc1ccccc1)C(=O)NC1[C@@H](O)Cc2ccccc12
: