Target
Gag-Pol polyprotein [489-587]
Ligand
BDBM853
Substrate
Meas. Tech.
ChEMBL_158026 (CHEMBL768619)
Ki
0.550000±n/a nM
Kd
0.643±n/a nM
KON
477000 M-1s-1
Citation
 Markgren, POSchaal, WHämäläinen, MKarlén, AHallberg, ASamuelsson, BDanielson, UH Relationships between structure and interaction kinetics for HIV-1 protease inhibitors. J Med Chem 45:5430-9 (2002)  
Target
Name:
Gag-Pol polyprotein [489-587]
Synonyms:
Human immunodeficiency virus type 1 protease Pol polyprotein | gag-pol
Type:
Enzyme Subunit
Mol. Mass.:
10781.16
Organism:
Human immunodeficiency virus type 1
Description:
P04585[489-587]
Residue:
99
  
Inhibitor
Name:
BDBM853
Synonyms:
(2R,3R,4R,5R)-3,4-dihydroxy-N,N'-bis[(1S)-2-methyl-1-(methylcarbamoyl)propyl]-2,5-bis({[4-(1,3-thiazol-2-yl)phenyl]methoxy})hexanediamide CHEMBL340116 | N1,N6-Bis[(1S)-2-methyl-1-(methylcarbamoyl)propyl]-(2R,3R,4R,5R)-2,5-bis[4-(2-thiazolyl)benzyloxy]-3,4-dihydroxyhexanediamide
Type:
Small organic molecule
Emp. Form.:
C38H48N6O8S2
Mol. Mass.:
780.953
SMILES:
CNC(=O)[C@@H](NC(=O)[C@H](OCc1ccc(cc1)-c1nccs1)[C@H](O)[C@@H](O)[C@@H](OCc1ccc(cc1)-c1nccs1)C(=O)N[C@@H](C(C)C)C(=O)NC)C(C)C
: