Target
D(4) dopamine receptor
Ligand
BDBM50122050
Substrate
Meas. Tech.
ChEMBL_60680 (CHEMBL675942)
Ki
0.018±n/a nM
Citation
 Leopoldo, MBerardi, FColabufo, NADe Giorgio, PLacivita, EPerrone, RTortorella, V Structure-affinity relationship study on N-[4-(4-arylpiperazin-1-yl)butyl]arylcarboxamides as potent and selective dopamine D(3) receptor ligands. J Med Chem 45:5727-35 (2002)  
Target
Name:
D(4) dopamine receptor
Synonyms:
D(2C) dopamine receptor DOPAMINE D4.2 DRD4 Dopamine D4 receptor
Type:
Enzyme
Mol. Mass.:
48373.19
Organism:
Homo sapiens (Human)
Description:
P21917
Residue:
419
  
Inhibitor
Name:
BDBM50122050
Synonyms:
CHEMBL156599 | N-{2-[4-(2,3-Dichloro-phenyl)-piperazin-1-yl]-ethyl}-3-methoxy-benzamide
Type:
Small organic molecule
Emp. Form.:
C20H23Cl2N3O2
Mol. Mass.:
408.322
SMILES:
COc1cccc(c1)C(=O)NCCN1CCN(CC1)c1cccc(Cl)c1Cl
: