Target
D(4) dopamine receptor
Ligand
BDBM50068362
Substrate
Meas. Tech.
ChEMBL_60680 (CHEMBL675942)
Ki
1.1±n/a nM
Citation
 Leopoldo, MBerardi, FColabufo, NADe Giorgio, PLacivita, EPerrone, RTortorella, V Structure-affinity relationship study on N-[4-(4-arylpiperazin-1-yl)butyl]arylcarboxamides as potent and selective dopamine D(3) receptor ligands. J Med Chem 45:5727-35 (2002)  
Target
Name:
D(4) dopamine receptor
Synonyms:
D(2C) dopamine receptor DOPAMINE D4.2 DRD4 Dopamine D4 receptor
Type:
Enzyme
Mol. Mass.:
48373.19
Organism:
Homo sapiens (Human)
Description:
P21917
Residue:
419
  
Inhibitor
Name:
BDBM50068362
Synonyms:
3-Methoxy-N-{2-[4-(2-methoxy-phenyl)-piperazin-1-yl]-ethyl}-benzamide | CHEMBL286725
Type:
Small organic molecule
Emp. Form.:
C21H27N3O3
Mol. Mass.:
369.4574
SMILES:
COc1cccc(c1)C(=O)NCCN1CCN(CC1)c1ccccc1OC
: