Target
D(3) dopamine receptor
Ligand
BDBM50122056
Substrate
Meas. Tech.
ChEMBL_62757 (CHEMBL676126)
Ki
1.15±n/a nM
Citation
 Leopoldo, MBerardi, FColabufo, NADe Giorgio, PLacivita, EPerrone, RTortorella, V Structure-affinity relationship study on N-[4-(4-arylpiperazin-1-yl)butyl]arylcarboxamides as potent and selective dopamine D(3) receptor ligands. J Med Chem 45:5727-35 (2002)  
Target
Name:
D(3) dopamine receptor
Synonyms:
DOPAMINE D3 Dopamine D3 receptor | Drd3
Type:
Protein
Mol. Mass.:
49540.58
Organism:
Rattus norvegicus (Rat)
Description:
P19020
Residue:
446
  
Inhibitor
Name:
BDBM50122056
Synonyms:
Biphenyl-4-carboxylic acid {4-[4-(2,3-dichloro-phenyl)-piperazin-1-yl]-butyl}-amide | CHEMBL305362
Type:
Small organic molecule
Emp. Form.:
C27H29Cl2N3O
Mol. Mass.:
482.445
SMILES:
Clc1cccc(N2CCN(CCCCNC(=O)c3ccc(cc3)-c3ccccc3)CC2)c1Cl
: