Target
Matrix metalloproteinase-9
Ligand
BDBM50109617
Substrate
Meas. Tech.
ChEMBL_105387 (CHEMBL710806)
Ki
6.470±n/a nM
Citation
 Sawa, MKiyoi, TKurokawa, KKumihara, HYamamoto, MMiyasaka, TIto, YHirayama, RInoue, TKirii, YNishiwaki, EOhmoto, HMaeda, YIshibushi, EInoue, YYoshino, KKondo, H New type of metalloproteinase inhibitor: design and synthesis of new phosphonamide-based hydroxamic acids. J Med Chem 45:919-29 (2002)  
Target
Name:
Matrix metalloproteinase-9
Synonyms:
67 kDa matrix metalloproteinase-9 92 kDa gelatinase CLG4B Gelatinase B MMP9 Matrix metalloproteinase 9 (MMP-9) Matrix metalloproteinase-9 (MMP9)
Type:
Enzyme
Mol. Mass.:
78452.28
Organism:
Homo sapiens (Human)
Description:
P14780
Residue:
707
  
Inhibitor
Name:
BDBM50109617
Synonyms:
(3-Hydroxycarbamoyl-3,4-dihydro-1H-isoquinolin-2-yl)-(4-methoxy-phenyl)-phosphinic acid 2-biphenyl-4-yl-ethyl ester | CHEMBL173754
Type:
Small organic molecule
Emp. Form.:
C31H31N2O5P
Mol. Mass.:
542.562
SMILES:
COc1ccc(cc1)P(=O)(OCCc1ccc(cc1)-c1ccccc1)N1Cc2ccccc2CC1C(=O)NO
: