Target
Disintegrin and metalloproteinase domain-containing protein 17
Ligand
BDBM50370191
Substrate
Meas. Tech.
ChEMBL_212582 (CHEMBL811884)
Ki
7.15±n/a nM
Citation
 Sawa, MKiyoi, TKurokawa, KKumihara, HYamamoto, MMiyasaka, TIto, YHirayama, RInoue, TKirii, YNishiwaki, EOhmoto, HMaeda, YIshibushi, EInoue, YYoshino, KKondo, H New type of metalloproteinase inhibitor: design and synthesis of new phosphonamide-based hydroxamic acids. J Med Chem 45:919-29 (2002)  
Target
Name:
Disintegrin and metalloproteinase domain-containing protein 17
Synonyms:
ADA17_HUMAN CSVP Disintegrin and metalloproteinase domain-containing protein 17 (ADAM17) TNF-alpha convertase TNF-alpha-converting enzyme (TACE) Tumor necrosis factor-α converting enzyme (TACE)
Type:
Enzyme
Mol. Mass.:
93007.89
Organism:
Homo sapiens (Human)
Description:
Residue:
824
  
Inhibitor
Name:
BDBM50370191
Synonyms:
CHEMBL366478
Type:
Small organic molecule
Emp. Form.:
C19H23N2O5P
Mol. Mass.:
390.3701
SMILES:
CCO[P@](=O)(N1Cc2ccccc2CC1C(=O)NO)c1ccc(OC)cc1
: