Target
Interstitial collagenase
Ligand
BDBM50109631
Substrate
Meas. Tech.
ChEMBL_106139 (CHEMBL718686)
Ki
3.14±n/a nM
Citation
 Sawa, MKiyoi, TKurokawa, KKumihara, HYamamoto, MMiyasaka, TIto, YHirayama, RInoue, TKirii, YNishiwaki, EOhmoto, HMaeda, YIshibushi, EInoue, YYoshino, KKondo, H New type of metalloproteinase inhibitor: design and synthesis of new phosphonamide-based hydroxamic acids. J Med Chem 45:919-29 (2002)  
Target
Name:
Interstitial collagenase
Synonyms:
CLG MMP1 Matrix metalloproteinase-1 | Matrix metalloproteinase-1 (MMP-1)
Type:
Enzyme
Mol. Mass.:
54010.26
Organism:
Homo sapiens (Human)
Description:
P03956
Residue:
469
  
Inhibitor
Name:
BDBM50109631
Synonyms:
(3-Hydroxycarbamoyl-3,4-dihydro-1H-isoquinolin-2-yl)-(4-methoxy-phenyl)-phosphinic acid 2-pyridin-2-yl-ethyl ester | CHEMBL173027
Type:
Small organic molecule
Emp. Form.:
C24H26N3O5P
Mol. Mass.:
467.4541
SMILES:
COc1ccc(cc1)P(=O)(OCCc1ccccn1)N1Cc2ccccc2CC1C(=O)NO
: