Target
Interstitial collagenase
Ligand
BDBM50109622
Substrate
Meas. Tech.
ChEMBL_106139 (CHEMBL718686)
Ki
6.67±n/a nM
Citation
 Sawa, MKiyoi, TKurokawa, KKumihara, HYamamoto, MMiyasaka, TIto, YHirayama, RInoue, TKirii, YNishiwaki, EOhmoto, HMaeda, YIshibushi, EInoue, YYoshino, KKondo, H New type of metalloproteinase inhibitor: design and synthesis of new phosphonamide-based hydroxamic acids. J Med Chem 45:919-29 (2002)  
Target
Name:
Interstitial collagenase
Synonyms:
CLG MMP1 Matrix metalloproteinase-1 | Matrix metalloproteinase-1 (MMP-1)
Type:
Enzyme
Mol. Mass.:
54010.26
Organism:
Homo sapiens (Human)
Description:
P03956
Residue:
469
  
Inhibitor
Name:
BDBM50109622
Synonyms:
(3-Hydroxycarbamoyl-3,4-dihydro-1H-isoquinolin-2-yl)-(4-methoxy-phenyl)-phosphinic acid cyclohexylmethyl ester | CHEMBL173846
Type:
Small organic molecule
Emp. Form.:
C24H31N2O5P
Mol. Mass.:
458.4871
SMILES:
COc1ccc(cc1)P(=O)(OCC1CCCCC1)N1Cc2ccccc2CC1C(=O)NO
: