Target
Interstitial collagenase
Ligand
BDBM50109612
Substrate
Meas. Tech.
ChEMBL_106139 (CHEMBL718686)
Ki
24±n/a nM
Citation
 Sawa, MKiyoi, TKurokawa, KKumihara, HYamamoto, MMiyasaka, TIto, YHirayama, RInoue, TKirii, YNishiwaki, EOhmoto, HMaeda, YIshibushi, EInoue, YYoshino, KKondo, H New type of metalloproteinase inhibitor: design and synthesis of new phosphonamide-based hydroxamic acids. J Med Chem 45:919-29 (2002)  
Target
Name:
Interstitial collagenase
Synonyms:
CLG MMP1 Matrix metalloproteinase-1 | Matrix metalloproteinase-1 (MMP-1)
Type:
Enzyme
Mol. Mass.:
54010.26
Organism:
Homo sapiens (Human)
Description:
P03956
Residue:
469
  
Inhibitor
Name:
BDBM50109612
Synonyms:
(2-Fluoro-phenyl)-(3-hydroxycarbamoyl-3,4-dihydro-1H-isoquinolin-2-yl)-phosphinic acid ethyl ester | CHEMBL173326
Type:
Small organic molecule
Emp. Form.:
C18H20FN2O4P
Mol. Mass.:
378.3346
SMILES:
CCOP(=O)(N1Cc2ccccc2CC1C(=O)NO)c1ccccc1F
: