Target
Matrix metalloproteinase-9
Ligand
BDBM50109628
Substrate
Meas. Tech.
ChEMBL_105387 (CHEMBL710806)
Ki
42.7±n/a nM
Citation
 Sawa, MKiyoi, TKurokawa, KKumihara, HYamamoto, MMiyasaka, TIto, YHirayama, RInoue, TKirii, YNishiwaki, EOhmoto, HMaeda, YIshibushi, EInoue, YYoshino, KKondo, H New type of metalloproteinase inhibitor: design and synthesis of new phosphonamide-based hydroxamic acids. J Med Chem 45:919-29 (2002)  
Target
Name:
Matrix metalloproteinase-9
Synonyms:
67 kDa matrix metalloproteinase-9 92 kDa gelatinase CLG4B Gelatinase B MMP9 Matrix metalloproteinase 9 (MMP-9) Matrix metalloproteinase-9 (MMP9)
Type:
Enzyme
Mol. Mass.:
78452.28
Organism:
Homo sapiens (Human)
Description:
P14780
Residue:
707
  
Inhibitor
Name:
BDBM50109628
Synonyms:
(3-Hydroxycarbamoyl-3,4-dihydro-1H-isoquinolin-2-yl)-phenyl-phosphinic acid ethyl ester | CHEMBL172548
Type:
Small organic molecule
Emp. Form.:
C18H21N2O4P
Mol. Mass.:
360.3441
SMILES:
CCOP(=O)(N1Cc2ccccc2CC1C(=O)NO)c1ccccc1
: