Target
Stromelysin-1
Ligand
BDBM50109628
Substrate
Meas. Tech.
ChEMBL_104748 (CHEMBL715873)
Ki
34.9±n/a nM
Citation
 Sawa, MKiyoi, TKurokawa, KKumihara, HYamamoto, MMiyasaka, TIto, YHirayama, RInoue, TKirii, YNishiwaki, EOhmoto, HMaeda, YIshibushi, EInoue, YYoshino, KKondo, H New type of metalloproteinase inhibitor: design and synthesis of new phosphonamide-based hydroxamic acids. J Med Chem 45:919-29 (2002)  
Target
Name:
Stromelysin-1
Synonyms:
MMP-3 MMP3_HUMAN Matrix metalloproteinase 3 Matrix metalloproteinase-3 (MMP-3) SL-1 Stromelysin 1 | Transin-1
Type:
Enzyme
Mol. Mass.:
53973.13
Organism:
Homo sapiens (Human)
Description:
P08254
Residue:
477
  
Inhibitor
Name:
BDBM50109628
Synonyms:
(3-Hydroxycarbamoyl-3,4-dihydro-1H-isoquinolin-2-yl)-phenyl-phosphinic acid ethyl ester | CHEMBL172548
Type:
Small organic molecule
Emp. Form.:
C18H21N2O4P
Mol. Mass.:
360.3441
SMILES:
CCOP(=O)(N1Cc2ccccc2CC1C(=O)NO)c1ccccc1
: