Target
Interstitial collagenase
Ligand
BDBM50109624
Substrate
Meas. Tech.
ChEMBL_106139 (CHEMBL718686)
Ki
4.1±n/a nM
Citation
 Sawa, MKiyoi, TKurokawa, KKumihara, HYamamoto, MMiyasaka, TIto, YHirayama, RInoue, TKirii, YNishiwaki, EOhmoto, HMaeda, YIshibushi, EInoue, YYoshino, KKondo, H New type of metalloproteinase inhibitor: design and synthesis of new phosphonamide-based hydroxamic acids. J Med Chem 45:919-29 (2002)  
Target
Name:
Interstitial collagenase
Synonyms:
CLG MMP1 Matrix metalloproteinase-1 | Matrix metalloproteinase-1 (MMP-1)
Type:
Enzyme
Mol. Mass.:
54010.26
Organism:
Homo sapiens (Human)
Description:
P03956
Residue:
469
  
Inhibitor
Name:
BDBM50109624
Synonyms:
(6-Hydroxycarbamoyl-6,7-dihydro-4H-thieno[3,2-c]pyridin-5-yl)-(4-methoxy-phenyl)-phosphinic acid ethyl ester | CHEMBL173316
Type:
Small organic molecule
Emp. Form.:
C17H21N2O5PS
Mol. Mass.:
396.398
SMILES:
CCOP(=O)(N1Cc2ccsc2CC1C(=O)NO)c1ccc(OC)cc1
: