Target
Type-1 angiotensin II receptor B
Ligand
BDBM50112097
Substrate
Meas. Tech.
ChEMBL_34943 (CHEMBL647786)
Ki
1.7±n/a nM
Citation
 Johannesson, PLindeberg, GJohansson, ANikiforovich, GVGogoll, ASynnergren, BLe Grèves, MNyberg, FKarlén, AHallberg, A Vinyl sulfide cyclized analogues of angiotensin II with high affinity and full agonist activity at the AT(1) receptor. J Med Chem 45:1767-77 (2002)  
Target
Name:
Type-1 angiotensin II receptor B
Synonyms:
AGTRB_RAT Agtr1 Angiotensin II AT1B Angiotensin II type 1b (AT-1b) receptor Type-1B angiotensin II receptor
Type:
Enzyme Catalytic Domain
Mol. Mass.:
40929.44
Organism:
RAT
Description:
Angiotensin II AT1B 0 RAT::P29089
Residue:
359
  
Inhibitor
Name:
BDBM50112097
Synonyms:
CHEMBL266450 | analog of Angiotensin II with trans vinyl sulfide bridge
Type:
Small organic molecule
Emp. Form.:
C48H63N13O12S
Mol. Mass.:
1046.159
SMILES:
N[C@@H](CC(O)=O)C(=O)N[C@@H](CCCN=C(N)N)C(=O)N[C@H]1CS\C=C\CC[C@H](NC(=O)[C@H](Cc2ccc(O)cc2)NC1=O)C(=O)N[C@@H](Cc1cnc[nH]1)C(=O)N1CCC[C@H]1C(=O)N[C@@H](Cc1ccccc1)C(O)=O
: