Target
Acetylcholinesterase
Ligand
BDBM50122492
Substrate
Meas. Tech.
ChEMBL_27955 (CHEMBL649135)
Ki
3.7±n/a nM
Citation
 Savini, LGaeta, AFattorusso, CCatalanotti, BCampiani, GChiasserini, LPellerano, CNovellino, EMcKissic, DSaxena, A Specific targeting of acetylcholinesterase and butyrylcholinesterase recognition sites. Rational design of novel, selective, and highly potent cholinesterase inhibitors. J Med Chem 46:1-4 (2002)  
Target
Name:
Acetylcholinesterase
Synonyms:
ACES_BOVIN Acetylcholinesterase (AChE) | Acetylcholinesterase precursor
Type:
Enzyme
Mol. Mass.:
67659.62
Organism:
Bos taurus (bovine)
Description:
Residue:
613
  
Inhibitor
Name:
BDBM50122492
Synonyms:
CHEMBL131386 | N-[3-(6,8-Dichloro-1,2,3,4-tetrahydro-acridin-9-ylamino)-propyl]-N-methyl-N'-(1,2,3,4-tetrahydro-acridin-9-yl)-propane-1,3-diamine
Type:
Small organic molecule
Emp. Form.:
C33H39Cl2N5
Mol. Mass.:
576.602
SMILES:
CN(CCCNc1c2CCCCc2nc2ccccc12)CCCNc1c2CCCCc2nc2cc(Cl)cc(Cl)c12
: