Target
Beta-2 adrenergic receptor
Ligand
BDBM50122649
Substrate
Meas. Tech.
ChEMBL_38606 (CHEMBL652289)
IC50
520±n/a nM
Citation
 Tanaka, NTamai, TMukaiyama, HHirabayashi, AMuranaka, HIshikawa, TKobayashi, JAkahane, SAkahane, M Relationship between stereochemistry and the beta3-adrenoceptor agonistic activity of 4'-hydroxynorephedrine derivative as an agent for treatment of frequent urination and urinary incontinence. J Med Chem 46:105-12 (2002)  
Target
Name:
Beta-2 adrenergic receptor
Synonyms:
ADRB2_RAT Adrb2r | Adrenergic receptor beta
Type:
PROTEIN
Mol. Mass.:
46896.26
Organism:
Rattus norvegicus
Description:
ChEMBL_38603
Residue:
418
  
Inhibitor
Name:
BDBM50122649
Synonyms:
(2-Chloro-4-{2-[2-hydroxy-2-(4-hydroxy-phenyl)-1-methyl-ethylamino]-ethyl}-phenoxy)-acetic acid ethyl ester; hydrochloride | CHEMBL544427
Type:
Small organic molecule
Emp. Form.:
C21H26ClNO5
Mol. Mass.:
407.888
SMILES:
CCOC(=O)COc1ccc(CCNC(C)C(O)c2ccc(O)cc2)cc1Cl
: