Target
D(2) dopamine receptor
Ligand
BDBM50122735
Substrate
Meas. Tech.
ChEMBL_59633 (CHEMBL672423)
Ki
4±n/a nM
Citation
 Macchia, MCervetto, LDemontis, GCLongoni, BMinutolo, FOrlandini, EOrtore, GPapi, CSbrana, AMacchia, B New N-n-propyl-substituted 3-aryl- and 3-cyclohexylpiperidines as partial agonists at the D4 dopamine receptor. J Med Chem 46:161-8 (2002)  
Target
Name:
D(2) dopamine receptor
Synonyms:
DOPAMINE D2 DRD2_BOVIN | Dopamine D2 receptor
Type:
Enzyme Catalytic Domain
Mol. Mass.:
50698.79
Organism:
BOVINE
Description:
P20288
Residue:
444
  
Inhibitor
Name:
BDBM50122735
Synonyms:
3-(4-Methyl-cyclohexyl)-1-propyl-piperidine; hydrochloride | CHEMBL544961
Type:
Small organic molecule
Emp. Form.:
C15H29N
Mol. Mass.:
223.3975
SMILES:
CCCN1CCCC(C1)C1CCC(C)CC1
: