Target
B1 bradykinin receptor
Ligand
BDBM50127448
Substrate
Meas. Tech.
ChEMBL_39982 (CHEMBL653556)
Ki
97.5±n/a nM
Citation
 Wood, MRKim, JJHan, WDorsey, BDHomnick, CFDiPardo, RMKuduk, SDMacNeil, TMurphy, KLLis, EVRansom, RWStump, GLLynch, JJO'Malley, SSMiller, PJChen, TBHarrell, CMChang, RSSandhu, PEllis, JDBondiskey, PJPettibone, DJFreidinger, RMBock, MG Benzodiazepines as potent and selective bradykinin B1 antagonists. J Med Chem 46:1803-6 (2003)  
Target
Name:
B1 bradykinin receptor
Synonyms:
B1 BRADYKININ B1R BK-1 receptor BRADYB1 | Bradykinin B1 receptor
Type:
Enzyme
Mol. Mass.:
40508.87
Organism:
Homo sapiens (Human)
Description:
P46663
Residue:
353
  
Inhibitor
Name:
BDBM50127448
Synonyms:
1-(5-Cyclohexyl-2-oxo-1-propyl-2,3-dihydro-1H-benzo[e][1,4]diazepin-3-yl)-3-[4-(4-pyridin-2-yl-piperazin-1-yl)-phenyl]-urea | CHEMBL298860
Type:
Small organic molecule
Emp. Form.:
C34H41N7O2
Mol. Mass.:
579.735
SMILES:
CCCN1c2ccccc2C(=NC(NC(=O)Nc2ccc(cc2)N2CCN(CC2)c2ccccn2)C1=O)C1CCCCC1
: