Target
B1 bradykinin receptor
Ligand
BDBM50127449
Substrate
Meas. Tech.
ChEMBL_39982 (CHEMBL653556)
Ki
141±n/a nM
Citation
 Wood, MRKim, JJHan, WDorsey, BDHomnick, CFDiPardo, RMKuduk, SDMacNeil, TMurphy, KLLis, EVRansom, RWStump, GLLynch, JJO'Malley, SSMiller, PJChen, TBHarrell, CMChang, RSSandhu, PEllis, JDBondiskey, PJPettibone, DJFreidinger, RMBock, MG Benzodiazepines as potent and selective bradykinin B1 antagonists. J Med Chem 46:1803-6 (2003)  
Target
Name:
B1 bradykinin receptor
Synonyms:
B1 BRADYKININ B1R BK-1 receptor BRADYB1 | Bradykinin B1 receptor
Type:
Enzyme
Mol. Mass.:
40508.87
Organism:
Homo sapiens (Human)
Description:
P46663
Residue:
353
  
Inhibitor
Name:
BDBM50127449
Synonyms:
CHEMBL30525 | iN-(4-[1,4']Bipiperidinyl-1'-yl-phenyl)-4-(5-cyclohexyl-2-oxo-2,3-dihydro-benzo[e][1,4]diazepin-1-yl)-butyramide
Type:
Small organic molecule
Emp. Form.:
C35H47N5O2
Mol. Mass.:
569.78
SMILES:
O=C(CCCN1c2ccccc2C(=NCC1=O)C1CCCCC1)Nc1ccc(cc1)N1CCC(CC1)N1CCCCC1
: