Target
Sodium-dependent dopamine transporter
Ligand
BDBM50130347
Substrate
Meas. Tech.
ChEMBL_62627 (CHEMBL678249)
Ki
10.9±n/a nM
Citation
 Zou, MFKopajtic, TKatz, JLNewman, AH Structure-activity relationship comparison of (S)-2beta-substituted 3alpha-(bis[4-fluorophenyl]methoxy)tropanes and (R)-2beta-substituted 3beta-(3,4-dichlorophenyl)tropanes at the dopamine transporter. J Med Chem 46:2908-16 (2003)  
Target
Name:
Sodium-dependent dopamine transporter
Synonyms:
DA transporter SC6A3_RAT Sodium-dependent dopamine transporter | Sodium-dependent dopamine transporter (DAT)
Type:
Multi-pass membrane protein
Mol. Mass.:
68749.45
Organism:
Rattus norvegicus (rat)
Description:
P23977
Residue:
619
  
Inhibitor
Name:
BDBM50130347
Synonyms:
3-(3,4-Dichloro-phenyl)-8-methyl-8-aza-bicyclo[3.2.1]octane-2-carboxylic acid phenethyl ester | CHEMBL318184
Type:
Small organic molecule
Emp. Form.:
C23H25Cl2NO2
Mol. Mass.:
418.356
SMILES:
CN1C2CCC1[C@H]([C@H](C2)c1ccc(Cl)c(Cl)c1)C(=O)OCCc1ccccc1
: