Target
D(3) dopamine receptor
Ligand
BDBM10755
Substrate
Meas. Tech.
ChEMBL_62916 (CHEMBL670711)
EC50
523±n/a nM
Citation
 Campiani, GButini, STrotta, FFattorusso, CCatalanotti, BAiello, FGemma, SNacci, VNovellino, EStark, JACagnotto, AFumagalli, ECarnovali, FCervo, LMennini, T Synthesis and pharmacological evaluation of potent and highly selective D3 receptor ligands: inhibition of cocaine-seeking behavior and the role of dopamine D3/D2 receptors. J Med Chem 46:3822-39 (2003)  
Target
Name:
D(3) dopamine receptor
Synonyms:
DOPAMINE D3 DRD3_HUMAN Dopamine D3 receptor (D3) Dopamine receptor Dopamine receptor D3
Type:
Mol. Mass.:
44243.43
Organism:
Homo sapiens (Human)
Description:
Residue:
400
  
Inhibitor
Name:
BDBM10755
Synonyms:
14C-5-hydroxy tryptamine creatinine disulfate 5-HT 5-hydroxy tryptamine creatinine disulfate Serotonin | [3H]-5-HT
Type:
Small organic molecule
Emp. Form.:
C10H12N2O
Mol. Mass.:
176.2151
SMILES:
NCCc1c[nH]c2ccc(O)cc12
: