Target
Coagulation factor X
Ligand
BDBM50133074
Substrate
Meas. Tech.
ChEMBL_48634 (CHEMBL659615)
IC50
1700±n/a nM
Citation
 Parlow, JJDice, TALachance, RMGirard, TJStevens, AMStegeman, RAStallings, WCKurumbail, RGSouth, MS Polymer-assisted solution-phase library synthesis and crystal structure of alpha-ketothiazoles as tissue factor VIIa inhibitors. J Med Chem 46:4043-9 (2003)  
Target
Name:
Coagulation factor X
Synonyms:
Activated coagulation factor X (FXa) Coagulation factor X precursor F10 Factor X heavy chain Factor Xa Stuart-Prower factor
Type:
Enzyme
Mol. Mass.:
54726.60
Organism:
Homo sapiens (Human)
Description:
Residue:
488
  
Inhibitor
Name:
BDBM50133074
Synonyms:
(S)-6-Dimethylamino-2-((R)-3-phenyl-2-phenylmethanesulfonylamino-propionylamino)-hexanoic acid [(S)-4-guanidino-1-(thiazole-2-carbonyl)-butyl]-amide | CHEMBL337654
Type:
Small organic molecule
Emp. Form.:
C33H46N8O5S2
Mol. Mass.:
698.899
SMILES:
CN(C)CCCC[C@H](NC(=O)[C@@H](Cc1ccccc1)NS(=O)(=O)Cc1ccccc1)C(=O)N[C@@H](CCCNC(N)=N)C(=O)c1nccs1
: