Target
Coagulation factor VII
Ligand
BDBM50228753
Substrate
Meas. Tech.
ChEMBL_48452 (CHEMBL662230)
IC50
1030±n/a nM
Citation
 Parlow, JJDice, TALachance, RMGirard, TJStevens, AMStegeman, RAStallings, WCKurumbail, RGSouth, MS Polymer-assisted solution-phase library synthesis and crystal structure of alpha-ketothiazoles as tissue factor VIIa inhibitors. J Med Chem 46:4043-9 (2003)  
Target
Name:
Coagulation factor VII
Synonyms:
Eptacog alfa FA7_HUMAN Factor VIIa (fVIIa) SPCA serum prothrombin conversion accelerator
Type:
Enzyme
Mol. Mass.:
51599.89
Organism:
Homo sapiens (Human)
Description:
Residue:
466
  
Inhibitor
Name:
BDBM50228753
Synonyms:
(S)-N*1*-[(S)-4-Guanidino-1-(thiazole-2-carbonyl)-butyl]-2-((R)-3-phenyl-2-phenylmethanesulfonylamino-propionylamino)-succinamide CHEMBL257867
Type:
Small organic molecule
Emp. Form.:
C29H36N8O6S2
Mol. Mass.:
656.776
SMILES:
[#7]-[#6](=O)-[#6]-[#6@H](-[#7]-[#6](=O)-[#6@@H](-[#6]-c1ccccc1)-[#7]S(=O)(=O)[#6]-c1ccccc1)-[#6](=O)-[#7]-[#6@@H](-[#6]-[#6]-[#6]\[#7]=[#6](\[#7])-[#7])-[#6](=O)-c1nccs1
: