Target
Neurotensin receptor type 2
Ligand
BDBM50133193
Substrate
Meas. Tech.
ChEMBL_144310 (CHEMBL754355)
IC50
0.23±n/a nM
Citation
 Kokko, KPHadden, MKOrwig, KSMazella, JDix, TA In vitro analysis of stable, receptor-selective neurotensin[8-13] analogues. J Med Chem 46:4141-8 (2003)  
Target
Name:
Neurotensin receptor type 2
Synonyms:
Levocabastine-sensitive neurotensin receptor NTR2 NTR2_HUMAN Neurotensin receptor Neurotensin receptor type 2
Type:
PROTEIN
Mol. Mass.:
45404.76
Organism:
Homo sapiens (Human)
Description:
ChEMBL_1281495
Residue:
410
  
Inhibitor
Name:
BDBM50133193
Synonyms:
CHEMBL337721 | Neurotensin analogue
Type:
Small organic molecule
Emp. Form.:
C40H66N12O8
Mol. Mass.:
843.0276
SMILES:
CC[C@H](C)[C@H](NC(=O)[C@H](Cc1ccc(O)cc1)NC(=O)[C@@H]1CCCN1C(=O)[C@@H](N)CCCN=C(N)NC(=O)[C@@H](N)CCCN1CCN=C1N)C(=O)N[C@@H](CC(C)C)C(O)=O
: