Target
5-hydroxytryptamine receptor 1A
Ligand
BDBM50014945
Substrate
Meas. Tech.
ChEMBL_691 (CHEMBL616274)
IC50
19.6±n/a nM
Citation
 May, JAChen, HHRusinko, ALynch, VMSharif, NAMcLaughlin, MA A novel and selective 5-HT2 receptor agonist with ocular hypotensive activity: (S)-(+)-1-(2-aminopropyl)-8,9-dihydropyrano[3,2-e]indole. J Med Chem 46:4188-95 (2003)  
Target
Name:
5-hydroxytryptamine receptor 1A
Synonyms:
5-HT-1A 5-hydroxytryptamine receptor 1A (5-HT-1A) ADRB2RL1 Dopamine D2 receptor and serotonin 1a receptor HTR1A | Serotonin receptor 1A
Type:
Mol. Mass.:
46122.49
Organism:
Homo sapiens (Human)
Description:
Residue:
422
  
Inhibitor
Name:
BDBM50014945
Synonyms:
3-(2-aminopropyl)-1H-indol-5-ol alpha-M-5-HT alpha-methyl-5-hydroxytryptamine | alpha-methylserotonin
Type:
Small organic molecule
Emp. Form.:
C11H14N2O
Mol. Mass.:
190.2417
SMILES:
CC(N)Cc1c[nH]c2ccc(O)cc12
: