Target
5-hydroxytryptamine receptor 2B
Ligand
BDBM50014945
Substrate
Meas. Tech.
ChEMBL_2871 (CHEMBL617774)
Ki
13±n/a nM
Citation
 May, JAChen, HHRusinko, ALynch, VMSharif, NAMcLaughlin, MA A novel and selective 5-HT2 receptor agonist with ocular hypotensive activity: (S)-(+)-1-(2-aminopropyl)-8,9-dihydropyrano[3,2-e]indole. J Med Chem 46:4188-95 (2003)  
Target
Name:
5-hydroxytryptamine receptor 2B
Synonyms:
5-HT-2B 5-hydroxytryptamine (serotonin) receptor 2B [Homo sapiens] 5-hydroxytryptamine receptor 2C (5HT2C) HTR2B Serotonin 2b (5-HT2b) receptor | Serotonin Receptor 2B
Type:
G Protein-Coupled Receptor (GPCR)
Mol. Mass.:
54312.47
Organism:
Homo sapiens (Human)
Description:
Receptor binding assays were performed using human clone stably expressed in CHO cells.
Residue:
481
  
Inhibitor
Name:
BDBM50014945
Synonyms:
3-(2-aminopropyl)-1H-indol-5-ol alpha-M-5-HT alpha-methyl-5-hydroxytryptamine | alpha-methylserotonin
Type:
Small organic molecule
Emp. Form.:
C11H14N2O
Mol. Mass.:
190.2417
SMILES:
CC(N)Cc1c[nH]c2ccc(O)cc12
: